{"text_format":"3","workbook":"xlsx","n_sheets":3,"sheets":["Dados de Vendas","Relatório de vendas","Estoque"],"not_rendered":{"defined_names":10,"pivot_tables":1},"read":"whole","date_system":"1900"}

{"sheet":"Dados de Vendas","index":0,"n_rows":13,"n_cols":11,"rows_kept":13}
[]
[null,"VENDAS DIÁRIAS DA CAIXA REGISTRADORA"]
[]
[]
[]
[{"$nulls":10}," "]
[{"$nulls":10}," "]
[null,"DATA","HORA","NÚMERO DA TRANSAÇÃO","SKU/NÚMERO DO PRODUTO","DESCRIÇÃO","VALOR DA VENDA","% DE IMPOSTO","IMPOSTO SOBRE VENDAS","TOTAL"]
[null,"2012-02-01","10:30:00",1001,90001,{"$f":"IFERROR(IF(ISNA(VLOOKUP(tblDadosdeVendas[[#This Row],[SKU/NÚMERO DO PRODUTO]],tblInventário[],2,0)),\"\",VLOOKUP(tblDadosdeVendas[[#This Row],[SKU/NÚMERO DO PRODUTO]],tblInventário[],2,0)),\"Nenhuma descrição encontrada\")","v":"Cobertor"},{"v":74.95,"d":"R$ 74.95"},{"v":0.05,"d":"5.00%"},{"$f":"tblDadosdeVendas[[#This Row],[VALOR DA VENDA]]*tblDadosdeVendas[[#This Row],[% DE IMPOSTO]]","v":{"v":3.7475000000000005,"d":"R$ 3.75"}},{"$f":"tblDadosdeVendas[[#This Row],[VALOR DA VENDA]]+tblDadosdeVendas[[#This Row],[IMPOSTO SOBRE VENDAS]]","v":{"v":78.6975,"d":"R$ 78.70"}}]
[null,"2012-02-01","10:33:00",1002,90023,{"$f":"IFERROR(IF(ISNA(VLOOKUP(tblDadosdeVendas[[#This Row],[SKU/NÚMERO DO PRODUTO]],tblInventário[],2,0)),\"\",VLOOKUP(tblDadosdeVendas[[#This Row],[SKU/NÚMERO DO PRODUTO]],tblInventário[],2,0)),\"Nenhuma descrição encontrada\")","v":"Tolha de mesa, 6' redonda"},{"v":34.99,"d":"R$ 34.99"},{"v":0.05,"d":"5.00%"},{"$f":"tblDadosdeVendas[[#This Row],[VALOR DA VENDA]]*tblDadosdeVendas[[#This Row],[% DE IMPOSTO]]","v":{"v":1.7495000000000003,"d":"R$ 1.75"}},{"$f":"tblDadosdeVendas[[#This Row],[VALOR DA VENDA]]+tblDadosdeVendas[[#This Row],[IMPOSTO SOBRE VENDAS]]","v":{"v":36.7395,"d":"R$ 36.74"}}]
[null,"2012-02-01","10:45:00",1003,90005,{"$f":"IFERROR(IF(ISNA(VLOOKUP(tblDadosdeVendas[[#This Row],[SKU/NÚMERO DO PRODUTO]],tblInventário[],2,0)),\"\",VLOOKUP(tblDadosdeVendas[[#This Row],[SKU/NÚMERO DO PRODUTO]],tblInventário[],2,0)),\"Nenhuma descrição encontrada\")","v":"Prato redondo"},{"v":55.95,"d":"R$ 55.95"},{"v":0.05,"d":"5.00%"},{"$f":"tblDadosdeVendas[[#This Row],[VALOR DA VENDA]]*tblDadosdeVendas[[#This Row],[% DE IMPOSTO]]","v":{"v":2.7975000000000003,"d":"R$ 2.80"}},{"$f":"tblDadosdeVendas[[#This Row],[VALOR DA VENDA]]+tblDadosdeVendas[[#This Row],[IMPOSTO SOBRE VENDAS]]","v":{"v":58.7475,"d":"R$ 58.75"}}]
[null,"2012-02-01","10:55:00",1004,90004,{"$f":"IFERROR(IF(ISNA(VLOOKUP(tblDadosdeVendas[[#This Row],[SKU/NÚMERO DO PRODUTO]],tblInventário[],2,0)),\"\",VLOOKUP(tblDadosdeVendas[[#This Row],[SKU/NÚMERO DO PRODUTO]],tblInventário[],2,0)),\"Nenhuma descrição encontrada\")","v":"Prato quadrado"},{"v":2.95,"d":"R$ 2.95"},{"v":0.05,"d":"5.00%"},{"$f":"tblDadosdeVendas[[#This Row],[VALOR DA VENDA]]*tblDadosdeVendas[[#This Row],[% DE IMPOSTO]]","v":{"v":0.14750000000000002,"d":"R$ 0.15"}},{"$f":"tblDadosdeVendas[[#This Row],[VALOR DA VENDA]]+tblDadosdeVendas[[#This Row],[IMPOSTO SOBRE VENDAS]]","v":{"v":3.0975,"d":"R$ 3.10"}}]
[null,"2012-02-01","11:45:00",1005,90002,{"$f":"IFERROR(IF(ISNA(VLOOKUP(tblDadosdeVendas[[#This Row],[SKU/NÚMERO DO PRODUTO]],tblInventário[],2,0)),\"\",VLOOKUP(tblDadosdeVendas[[#This Row],[SKU/NÚMERO DO PRODUTO]],tblInventário[],2,0)),\"Nenhuma descrição encontrada\")","v":"Travesseiro"},{"v":14.98,"d":"R$ 14.98"},{"v":0.05,"d":"5.00%"},{"$f":"tblDadosdeVendas[[#This Row],[VALOR DA VENDA]]*tblDadosdeVendas[[#This Row],[% DE IMPOSTO]]","v":{"v":0.7490000000000001,"d":"R$ 0.75"}},{"$f":"tblDadosdeVendas[[#This Row],[VALOR DA VENDA]]+tblDadosdeVendas[[#This Row],[IMPOSTO SOBRE VENDAS]]","v":{"v":15.729000000000001,"d":"R$ 15.73"}}]

{"sheet":"Relatório de vendas","index":1,"n_rows":14,"n_cols":7,"rows_kept":14}
[]
[null,"VENDAS DIÁRIAS DA CAIXA REGISTRADORA"]
[]
[]
[]
[]
[]
[null,"SKU/NÚMERO DO PRODUTO","DESCRIÇÃO","DATA","VALOR DA VENDA ","IMPOSTO SOBRE VENDAS ","Total "]
[null,90001,"Cobertor","2012-02-01",{"v":74.95,"d":"R$ 74.95"},{"v":3.7475000000000005,"d":"R$ 3.75"},{"v":78.6975,"d":"R$ 78.70"}]
[null,90002,"Travesseiro","2012-02-01",{"v":14.98,"d":"R$ 14.98"},{"v":0.7490000000000001,"d":"R$ 0.75"},{"v":15.729000000000001,"d":"R$ 15.73"}]
[null,90004,"Prato quadrado","2012-02-01",{"v":2.95,"d":"R$ 2.95"},{"v":0.14750000000000002,"d":"R$ 0.15"},{"v":3.0975,"d":"R$ 3.10"}]
[null,90005,"Prato redondo","2012-02-01",{"v":55.95,"d":"R$ 55.95"},{"v":2.7975000000000003,"d":"R$ 2.80"},{"v":58.7475,"d":"R$ 58.75"}]
[null,90023,"Tolha de mesa, 6' redonda","2012-02-01",{"v":34.99,"d":"R$ 34.99"},{"v":1.7495000000000003,"d":"R$ 1.75"},{"v":36.7395,"d":"R$ 36.74"}]
[null,"Total Geral",null,null,{"v":183.82000000000002,"d":"R$ 183.82"},{"v":9.191000000000003,"d":"R$ 9.19"},{"v":193.011,"d":"R$ 193.01"}]

{"sheet":"Estoque","index":2,"n_rows":31,"n_cols":3,"rows_kept":31}
[]
[null,"VENDAS DIÁRIAS DA CAIXA REGISTRADORA"]
[]
[]
[]
[]
[]
[null,"SKU/NÚMERO DO PRODUTO","DESCRIÇÃO"]
[null,90001,"Cobertor"]
[null,90002,"Travesseiro"]
[null,90003,"Lençol"]
[null,90004,"Prato quadrado"]
[null,90005,"Prato redondo"]
[null,90006,"Tigela, grande"]
[null,90007,"Tigela, pequena"]
[null,90008,"Prato redondo, pequeno"]
[null,90009,"Garfo, pequeno"]
[null,90010,"Garfo, grande"]
[null,90011,"Colher, pequena"]
[null,90012,"Colher, grande"]
[null,90013,"Faca, pequena"]
[null,90014,"Faca, grande"]
[null,90015,"Tolha de mesa, 10x5"]
[null,90016,"Tolha de mesa, 8x5"]
[null,90017,"Tolha de mesa, 8x8"]
[null,90018,"Tolha de mesa, 6x6"]
[null,90019,"Tolha de mesa, 6x4"]
[null,90020,"Tolha de mesa, 4x4"]
[null,90021,"Tolha de mesa, 10' redonda"]
[null,90022,"Tolha de mesa, 8' redonda"]
[null,90023,"Tolha de mesa, 6' redonda"]